Reaction Details
TargetBeta-lactamase
LigandBDBM50033697
Substrate/Competitorn/a
Meas. Tech.ChEMBL_40539 (CHEMBL876084)
IC50>20000±n/a nM
Citation Buynak, JDWu, KBachmann, BKhasnis, DHua, LNguyen, HKCarver, CL Synthesis and biological activity of 7-alkylidenecephems. J Med Chem38:1022-34 (1995) Beta-lactamase
Name:Beta-lactamase
Type:PROTEIN
Mol. Mass.:41306.67
Organism:Enterobacter cloacae
Description:ChEMBL_40258
Residue:381
BDBM50033697
NameBDBM50033697
Synonyms:CHEMBL8571 | Sodium; (R)-3-acetoxymethyl-8-oxo-7-[2-oxo-prop-(Z)-ylidene]-5-thia-1-aza-bicyclo[4.2.0]oct-2-ene-2-carboxylate
TypeSmall organic molecule
Emp. Form.C13H12NO6S
Mol. Mass.310.303
SMILESCC(=O)OCC1=C(N2[C@H](SC1)C(=CC(C)=O)C2=O)C([O-])=O