Reaction Details
TargetSterol O-acyltransferase 1
LigandBDBM50033955
Substrate/Competitorn/a
Meas. Tech.ChEMBL_28792 (CHEMBL641702)
IC50 50±n/a nM
Citation Maduskuie, TPWilde, RGBillheimer, JTCromley, DAGermain, SGillies, PJHigley, CAJohnson, ALPennev, PShimshick, EJ Design, synthesis, and structure--activity relationship studies for a new imidazole series of J774 macrophage specific acyl-CoA:cholesterol acyltransferase (ACAT) inhibitors. J Med Chem38:1067-83 (1995) Sterol O-acyltransferase 1
Name:Sterol O-acyltransferase 1
Type:PROTEIN
Mol. Mass.:64165.56
Organism:Rattus norvegicus
Description:ChEMBL_28796
Residue:545
BDBM50033955
NameBDBM50033955
Synonyms:CHEMBL11201 | N-{5-[4,5-Bis-(4-dimethylamino-phenyl)-1H-imidazol-2-ylsulfanyl]-pentyl}-2-cyclohexyl-N-heptyl-acetamide
TypeSmall organic molecule
Emp. Form.C39H59N5OS
Mol. Mass.645.984
SMILESCCCCCCCN(CCCCCSc1nc(c([nH]1)-c1ccc(cc1)N(C)C)-c1ccc(cc1)N(C)C)C(=O)CC1CCCCC1