Reaction Details
TargetSterol O-acyltransferase 1
LigandBDBM50033965
Substrate/Competitorn/a
Meas. Tech.ChEMBL_28792 (CHEMBL641702)
IC50 480±n/a nM
Citation Maduskuie, TPWilde, RGBillheimer, JTCromley, DAGermain, SGillies, PJHigley, CAJohnson, ALPennev, PShimshick, EJ Design, synthesis, and structure--activity relationship studies for a new imidazole series of J774 macrophage specific acyl-CoA:cholesterol acyltransferase (ACAT) inhibitors. J Med Chem38:1067-83 (1995) Sterol O-acyltransferase 1
Name:Sterol O-acyltransferase 1
Type:PROTEIN
Mol. Mass.:64165.56
Organism:Rattus norvegicus
Description:ChEMBL_28796
Residue:545
BDBM50033965
NameBDBM50033965
Synonyms:1-(2-{3-[4,5-Bis-(4-methoxy-phenyl)-1H-imidazol-2-ylsulfanyl]-propoxy}-ethyl)-1-[2-(2-hydroxy-ethoxy)-ethyl]-3-isopropyl-urea | CHEMBL416705
TypeSmall organic molecule
Emp. Form.C30H42N4O6S
Mol. Mass.586.743
SMILESCOc1ccc(cc1)-c1nc(SCCCOCCN(CCOCCO)C(=O)NC(C)C)[nH]c1-c1ccc(OC)cc1