Reaction Details
TargetSterol O-acyltransferase 1
LigandBDBM50033983
Substrate/Competitorn/a
Meas. Tech.ChEMBL_28792 (CHEMBL641702)
IC50 270±n/a nM
Citation Maduskuie, TPWilde, RGBillheimer, JTCromley, DAGermain, SGillies, PJHigley, CAJohnson, ALPennev, PShimshick, EJ Design, synthesis, and structure--activity relationship studies for a new imidazole series of J774 macrophage specific acyl-CoA:cholesterol acyltransferase (ACAT) inhibitors. J Med Chem38:1067-83 (1995) Sterol O-acyltransferase 1
Name:Sterol O-acyltransferase 1
Type:PROTEIN
Mol. Mass.:64165.56
Organism:Rattus norvegicus
Description:ChEMBL_28796
Residue:545
BDBM50033983
NameBDBM50033983
Synonyms:1-{5-[4,5-Bis-(4-methoxy-phenyl)-1H-imidazol-2-ylsulfanyl]-pentyl}-3-(2,4-difluoro-phenyl)-1-(2-morpholin-4-yl-ethyl)-urea | CHEMBL269470
TypeSmall organic molecule
Emp. Form.C35H41F2N5O4S
Mol. Mass.665.793
SMILESCOc1ccc(cc1)-c1nc(SCCCCCN(CCN2CCOCC2)C(=O)Nc2ccc(F)cc2F)[nH]c1-c1ccc(OC)cc1