Reaction Details
TargetSterol O-acyltransferase 1
LigandBDBM50033995
Substrate/Competitorn/a
Meas. Tech.ChEMBL_28792 (CHEMBL641702)
IC50 60±n/a nM
Citation Maduskuie, TPWilde, RGBillheimer, JTCromley, DAGermain, SGillies, PJHigley, CAJohnson, ALPennev, PShimshick, EJ Design, synthesis, and structure--activity relationship studies for a new imidazole series of J774 macrophage specific acyl-CoA:cholesterol acyltransferase (ACAT) inhibitors. J Med Chem38:1067-83 (1995) Sterol O-acyltransferase 1
Name:Sterol O-acyltransferase 1
Type:PROTEIN
Mol. Mass.:64165.56
Organism:Rattus norvegicus
Description:ChEMBL_28796
Residue:545
BDBM50033995
NameBDBM50033995
Synonyms:3-(2,4-Difluoro-phenyl)-1-heptyl-1-[5-(1H-8-oxa-1,3-diaza-dibenzo[e,h]azulen-2-ylsulfanyl)-pentyl]-urea | CHEMBL273369
TypeSmall organic molecule
Emp. Form.C34H38F2N4O2S
Mol. Mass.604.753
SMILESCCCCCCCN(CCCCCSc1nc-2c([nH]1)-c1ccccc1Oc1ccccc-21)C(=O)Nc1ccc(F)cc1F