Reaction Details
TargetNeprilysin
LigandBDBM50034846
Substrate/Competitorn/a
Meas. Tech.ChEMBL_144613 (CHEMBL750541)
IC50 5±n/a nM
Citation Ksander, GMGhai, RDdeJesus, RDiefenbacher, CGYuan, ABerry, CSakane, YTrapani, A Dicarboxylic acid dipeptide neutral endopeptidase inhibitors. J Med Chem38:1689-700 (1995) Neprilysin
Name:Neprilysin
Type:Protein
Mol. Mass.:85789.59
Organism:Rattus norvegicus (Rat)
Description:P07861
Residue:750
BDBM50034846
NameBDBM50034846
Synonyms:(2R,4R)-5-Biphenyl-4-yl-4-(3-carboxy-propionylamino)-2-methyl-pentanoic acid US10123984, Compound 21d(S,S) | US20230285340, Compound 21c (R,R)
TypeSmall organic molecule
Emp. Form.C22H25NO5
Mol. Mass.383.4376
SMILESC[C@H](C[C@H](Cc1ccc(cc1)-c1ccccc1)NC(=O)CCC(O)=O)C(O)=O