Reaction Details
TargetNeprilysin
LigandBDBM50034854
Substrate/Competitorn/a
Meas. Tech.ChEMBL_144615 (CHEMBL750543)
IC50 90±n/a nM
Citation Ksander, GMGhai, RDdeJesus, RDiefenbacher, CGYuan, ABerry, CSakane, YTrapani, A Dicarboxylic acid dipeptide neutral endopeptidase inhibitors. J Med Chem38:1689-700 (1995) Neprilysin
Name:Neprilysin
Type:Protein
Mol. Mass.:85789.59
Organism:Rattus norvegicus (Rat)
Description:P07861
Residue:750
BDBM50034854
NameBDBM50034854
Synonyms:(2R,4S)-5-Biphenyl-4-yl-4-(4-carboxy-butyrylamino)-2-methyl-pentanoic acid US10123984, Compound 21e
TypeSmall organic molecule
Emp. Form.C23H27NO5
Mol. Mass.397.4642
SMILESC[C@H](C[C@@H](Cc1ccc(cc1)-c1ccccc1)NC(=O)CCCC(O)=O)C(O)=O