Reaction Details
TargetNeprilysin
LigandBDBM50034844
Substrate/Competitorn/a
Meas. Tech.ChEMBL_144615 (CHEMBL750543)
IC50 44±n/a nM
Citation Ksander, GMGhai, RDdeJesus, RDiefenbacher, CGYuan, ABerry, CSakane, YTrapani, A Dicarboxylic acid dipeptide neutral endopeptidase inhibitors. J Med Chem38:1689-700 (1995) Neprilysin
Name:Neprilysin
Type:Protein
Mol. Mass.:85789.59
Organism:Rattus norvegicus (Rat)
Description:P07861
Residue:750
BDBM50034844
NameBDBM50034844
Synonyms:(2R,4R)-5-Biphenyl-4-yl-4-(2-carboxy-ethylcarbamoyl)-2-phenoxy-pentanoic acid | CHEMBL46837
TypeSmall organic molecule
Emp. Form.C27H27NO6
Mol. Mass.461.5064
SMILESOC(=O)CCNC(=O)[C@@H](C[C@@H](Oc1ccccc1)C(O)=O)Cc1ccc(cc1)-c1ccccc1