Reaction Details
TargetDihydrofolate reductase
LigandBDBM18050
Substrate/Competitorn/a
Meas. Tech.ChEMBL_52836 (CHEMBL884360)
IC50 1±n/a nM
Citation Gangjee, AMavandadi, FQueener, SFMcGuire, JJ Novel 2,4-diamino-5-substituted-pyrrolo[2,3-d]pyrimidines as classical and nonclassical antifolate inhibitors of dihydrofolate reductases. J Med Chem38:2158-65 (1995) Dihydrofolate reductase
Name:Dihydrofolate reductase
Type:Enzyme
Mol. Mass.:23891.29
Organism:Pneumocystis carinii
Description:n/a
Residue:206
BDBM18050
NameBDBM18050
Synonyms:2-[(4-{[(2,4-diaminopteridin-6-yl)methyl](methyl)amino}phenyl)formamido]pentanedioic acid MTX cid_126941
TypeSmall organic molecule
Emp. Form.C20H22N8O5
Mol. Mass.454.4393
SMILESCN(Cc1cnc2nc(N)nc(N)c2n1)c1ccc(cc1)C(=O)N[C@@H](CCC(O)=O)C(O)=O