Reaction Details
TargetType-1 angiotensin II receptor
LigandBDBM50035429
Substrate/Competitorn/a
Meas. Tech.ChEMBL_36634 (CHEMBL652345)
Ki 29±n/a nM
Citation Chang, LLAshton, WTFlanagan, KLChen, TBO'Malley, SSZingaro, GJSiegl, PKKivlighn, SDLotti, VJChang, RS Triazolinone biphenylsulfonamides as angiotensin II receptor antagonists with high affinity for both the AT1 and AT2 subtypes. J Med Chem37:4464-78 (1995) Type-1 angiotensin II receptor
Name:Type-1 angiotensin II receptor
Type:Enzyme Catalytic Domain
Mol. Mass.:41009.15
Organism:RABBIT
Description:ANGIOTENSIN AT1 AGTR1 RABBIT::P34976
Residue:359
BDBM50035429
NameBDBM50035429
Synonyms:4'-[2-Butyl-6-(3-cyclohexyl-ureido)-benzoimidazol-1-ylmethyl]-biphenyl-2-carboxylic acid | CHEMBL130896
TypeSmall organic molecule
Emp. Form.C32H36N4O3
Mol. Mass.524.6532
SMILESCCCCc1nc2ccc(NC(=O)NC3CCCCC3)cc2n1Cc1ccc(cc1)-c1ccccc1C(O)=O