Reaction Details
TargetType-1 angiotensin II receptor
LigandBDBM50035454
Substrate/Competitorn/a
Meas. Tech.ChEMBL_36631 (CHEMBL652870)
IC50 0.080000±n/a nM
Citation Chang, LLAshton, WTFlanagan, KLChen, TBO'Malley, SSZingaro, GJSiegl, PKKivlighn, SDLotti, VJChang, RS Triazolinone biphenylsulfonamides as angiotensin II receptor antagonists with high affinity for both the AT1 and AT2 subtypes. J Med Chem37:4464-78 (1995) Type-1 angiotensin II receptor
Name:Type-1 angiotensin II receptor
Type:Enzyme Catalytic Domain
Mol. Mass.:41009.15
Organism:RABBIT
Description:ANGIOTENSIN AT1 AGTR1 RABBIT::P34976
Residue:359
BDBM50035454
NameBDBM50035454
Synonyms:CHEMBL343309 | Cyclopropanecarboxylic acid (3-{3-butyl-4-[2'-(2-chloro-benzoylsulfamoyl)-biphenyl-4-ylmethyl]-5-oxo-4,5-dihydro-[1,2,4]triazol-1-yl}-4-chloro-phenyl)-amide
TypeSmall organic molecule
Emp. Form.C36H33Cl2N5O5S
Mol. Mass.718.649
SMILESCCCCc1nn(-c2cc(NC(=O)C3CC3)ccc2Cl)c(=O)n1Cc1ccc(cc1)-c1ccccc1S(=O)(=O)NC(=O)c1ccccc1Cl