Reaction Details
TargetType-2 angiotensin II receptor
LigandBDBM50035444
Substrate/Competitorn/a
Meas. Tech.ChEMBL_36767 (CHEMBL651097)
IC50 1.4±n/a nM
Citation Chang, LLAshton, WTFlanagan, KLChen, TBO'Malley, SSZingaro, GJSiegl, PKKivlighn, SDLotti, VJChang, RS Triazolinone biphenylsulfonamides as angiotensin II receptor antagonists with high affinity for both the AT1 and AT2 subtypes. J Med Chem37:4464-78 (1995) Type-2 angiotensin II receptor
Name:Type-2 angiotensin II receptor
Type:Enzyme Catalytic Domain
Mol. Mass.:41346.62
Organism:RAT
Description:Angiotensin II AT2 0 0::P35351
Residue:363
BDBM50035444
NameBDBM50035444
Synonyms:4-[[2'-[N-(tert-Butoxycarbonyl)sulfamoyl]biphenyl-4-yl]methyl]-5-n-butyl-2-[2-chloro-5-(valerylamino)phenyl]-2,4-dihydro-3H-1,2,4-trizol-3-one | CHEMBL341828
TypeSmall organic molecule
Emp. Form.C35H42ClN5O6S
Mol. Mass.696.256
SMILESCCCCC(=O)Nc1ccc(Cl)c(c1)-n1nc(CCCC)n(Cc2ccc(cc2)-c2ccccc2S(=O)(=O)NC(=O)OC(C)(C)C)c1=O