Reaction Details
TargetMu-type opioid receptor
LigandBDBM50035476
Substrate/Competitorn/a
Meas. Tech.ChEMBL_136088 (CHEMBL745611)
IC50 31±n/a nM
Citation Chang, ACTakemori, AEOjala, WHGleason, WBPortoghese, PS kappa Opioid receptor selective affinity labels: electrophilic benzeneacetamides as kappa-selective opioid antagonists. J Med Chem37:4490-8 (1995) Mu-type opioid receptor
Name:Mu-type opioid receptor
Type:Enzyme Catalytic Domain
Mol. Mass.:11165.58
Organism:GUINEA PIG
Description:P97266
Residue:98
BDBM50035476
NameBDBM50035476
Synonyms:CHEMBL413530 | N-[(S)-1-(3-Amino-phenyl)-2-pyrrolidin-1-yl-ethyl]-2-(3,4-dichloro-phenyl)-N-methyl-acetamide
TypeSmall organic molecule
Emp. Form.C21H25Cl2N3O
Mol. Mass.406.349
SMILESCN([C@H](CN1CCCC1)c1cccc(N)c1)C(=O)Cc1ccc(Cl)c(Cl)c1