Reaction Details
TargetDelta-type opioid receptor
LigandBDBM50035476
Substrate/Competitorn/a
Meas. Tech.ChEMBL_146869 (CHEMBL749997)
IC50 89±n/a nM
Citation Chang, ACTakemori, AEOjala, WHGleason, WBPortoghese, PS kappa Opioid receptor selective affinity labels: electrophilic benzeneacetamides as kappa-selective opioid antagonists. J Med Chem37:4490-8 (1995) Delta-type opioid receptor
Name:Delta-type opioid receptor
Type:G Protein-Coupled Receptor (GPCR)
Mol. Mass.:40382.98
Organism:Homo sapiens (Human)
Description:Competition binding assays were carried out using membrane preparations from transfected HN9.10 cells that constitutively expressed the delta opioid receptor.
Residue:372
BDBM50035476
NameBDBM50035476
Synonyms:CHEMBL413530 | N-[(S)-1-(3-Amino-phenyl)-2-pyrrolidin-1-yl-ethyl]-2-(3,4-dichloro-phenyl)-N-methyl-acetamide
TypeSmall organic molecule
Emp. Form.C21H25Cl2N3O
Mol. Mass.406.349
SMILESCN([C@H](CN1CCCC1)c1cccc(N)c1)C(=O)Cc1ccc(Cl)c(Cl)c1