Reaction Details
TargetMu-type opioid receptor
LigandBDBM50035471
Substrate/Competitorn/a
Meas. Tech.ChEMBL_221916 (CHEMBL842481)
IC50 1799±n/a nM
Citation Chang, ACTakemori, AEOjala, WHGleason, WBPortoghese, PS kappa Opioid receptor selective affinity labels: electrophilic benzeneacetamides as kappa-selective opioid antagonists. J Med Chem37:4490-8 (1995) Mu-type opioid receptor
Name:Mu-type opioid receptor
Type:Enzyme Catalytic Domain
Mol. Mass.:11165.58
Organism:GUINEA PIG
Description:P97266
Residue:98
BDBM50035471
NameBDBM50035471
Synonyms:2-(3,4-Dichloro-phenyl)-N-[(S)-1-(3-isothiocyanato-phenyl)-2-pyrrolidin-1-yl-ethyl]-N-methyl-acetamide | CHEMBL38521
TypeSmall organic molecule
Emp. Form.C22H23Cl2N3OS
Mol. Mass.448.409
SMILESCN([C@H](CN1CCCC1)c1cccc(c1)N=C=S)C(=O)Cc1ccc(Cl)c(Cl)c1