Reaction Details
TargetTyrosine-protein kinase ABL1
LigandBDBM50490888
Substrate/Competitorn/a
Meas. Tech.ChEMBL_951962 (CHEMBL2353816)
IC50 0.015000±n/a nM
Citation Hong, SKim, JYun, SMLee, HPark, YHong, SSHong, S Discovery of new benzothiazole-based inhibitors of breakpoint cluster region-Abelson kinase including the T315I mutant. J Med Chem56:3531-45 (2013) 
 
Tyrosine-protein kinase ABL1
Name:Tyrosine-protein kinase ABL1
Type:Enzyme
Mol. Mass.:122897.30
Organism:Homo sapiens (Human)
Description:P00519
Residue:1130
BDBM50490888
NameBDBM50490888
Synonyms:CHEMBL2347725
TypeSmall organic molecule
Emp. Form.C22H27N5O2S
Mol. Mass.425.547
SMILESCOc1ccccc1-c1ccc2nc(NC(=O)NCCN3CCN(C)CC3)sc2c1