Reaction Details
TargetMacrophage migration inhibitory factor
LigandBDBM50491189
Substrate/Competitorn/a
Meas. Tech.ChEMBL_957350 (CHEMBL2377973)
Kd 35900±n/a nM
Citation Yu, WLJones, BDKang, MHammons, JCLa Clair, JJBurkart, MD Spirohexenolide A targets human macrophage migration inhibitory factor (hMIF). J Nat Prod76:817-23 (2013) 
 
Macrophage migration inhibitory factor
Name:Macrophage migration inhibitory factor
Type:Enzyme
Mol. Mass.:12478.18
Organism:Homo sapiens (Human)
Description:P14174
Residue:115
BDBM50491189
NameBDBM50491189
Synonyms:CHEMBL2375653
TypeSmall organic molecule
Emp. Form.C25H28O5
Mol. Mass.408.4868
SMILESC[C@H]1C[C@@]23OC(=O)\C(C2=O)=C2\OC\C(\C=C2)=C/[C@H](O)C\C=C\C(\C)=C\[C@@]3(C)C=C1C