Reaction Details
TargetHistamine H4 receptor
LigandBDBM26390
Substrate/Competitorn/a
Meas. Tech.ChEMBL_957491 (CHEMBL2378229)
Ki 7.9±n/a nM
Citation Engelhardt, HSchultes, Sde Graaf, CNijmeijer, SVischer, HFZuiderveld, OPDobler, JStachurski, KMayer, MArnhof, HScharn, DHaaksma, EEde Esch, IJLeurs, R Bispyrimidines as potent histamine H(4) receptor ligands: delineation of structure-activity relationships and detailed H(4) receptor binding mode. J Med Chem56:4264-76 (2013) 
 
Histamine H4 receptor
Name:Histamine H4 receptor
Type:G Protein-Coupled Receptor (GPCR)
Mol. Mass.:44517.02
Organism:Homo sapiens (Human)
Description:Binding assays were using CHO cells stably expressing hH4R receptors.
Residue:390
BDBM26390
NameBDBM26390
Synonyms:4-(4-methylpiperazin-1-yl)-6-phenylpyrimidin-2-amine | 6-aryl-2-aminopyrimidine, 3
TypeSmall organic molecule
Emp. Form.C15H19N5
Mol. Mass.269.3449
SMILESCN1CCN(CC1)c1cc(nc(N)n1)-c1ccccc1