Reaction Details
TargetMuscarinic acetylcholine receptor M2
LigandBDBM50035989
Substrate/Competitorn/a
Meas. Tech.ChEMBL_140196 (CHEMBL744913)
Ki 1.5±n/a nM
Citation Kiesewetter, DOLee, JLang, LPark, SGPaik, CHEckelman, WC Preparation of 18F-labeled muscarinic agonist with M2 selectivity. J Med Chem38:5-8 (1995) Muscarinic acetylcholine receptor M2
Name:Muscarinic acetylcholine receptor M2
Type:Enzyme Catalytic Domain
Mol. Mass.:51555.53
Organism:RAT
Description:P10980
Residue:466
BDBM50035989
NameBDBM50035989
Synonyms:1-Methyl-4-(4-propylsulfanyl-[1,2,5]thiadiazol-3-yl)-1,2,3,6-tetrahydro-pyridine | CHEMBL167932
TypeSmall organic molecule
Emp. Form.C11H17N3S2
Mol. Mass.255.403
SMILESCCCSc1nsnc1C1=CCN(C)CC1