Reaction Details
TargetMuscarinic receptor M1
LigandBDBM50407329
Substrate/Competitorn/a
Meas. Tech.ChEMBL_140162 (CHEMBL745467)
Ki 25±n/a nM
Citation Kiesewetter, DOLee, JLang, LPark, SGPaik, CHEckelman, WC Preparation of 18F-labeled muscarinic agonist with M2 selectivity. J Med Chem38:5-8 (1995) Muscarinic receptor M1
Name:Muscarinic receptor M1
Synonyms:Muscarinic acetylcholine receptor M1
Type:PROTEIN
Mol. Mass.:15022.43
Organism:Bos taurus
Description:ChEMBL_140161
Residue:139
BDBM50407329
NameBDBM50407329
Synonyms:CHEMBL2112938
TypeSmall organic molecule
Emp. Form.C10H14FN3S2
Mol. Mass.259.367
SMILESCN1CCC=C(C1)c1nsnc1SCCF