Reaction Details
TargetSigma non-opioid intracellular receptor 1
LigandBDBM50407329
Substrate/Competitorn/a
Meas. Tech.ChEMBL_201919 (CHEMBL808207)
Ki 21.66±n/a nM
Citation Kiesewetter, DOLee, JLang, LPark, SGPaik, CHEckelman, WC Preparation of 18F-labeled muscarinic agonist with M2 selectivity. J Med Chem38:5-8 (1995) Sigma non-opioid intracellular receptor 1
Name:Sigma non-opioid intracellular receptor 1
Type:Enzyme Catalytic Domain
Mol. Mass.:25124.85
Organism:Homo sapiens (Human)
Description:Q99720
Residue:223
BDBM50407329
NameBDBM50407329
Synonyms:CHEMBL2112938
TypeSmall organic molecule
Emp. Form.C10H14FN3S2
Mol. Mass.259.367
SMILESCN1CCC=C(C1)c1nsnc1SCCF