Reaction Details
TargetMuscarinic acetylcholine receptor
LigandBDBM50407329
Substrate/Competitorn/a
Meas. Tech.ChEMBL_138321 (CHEMBL748201)
Ki>10000±n/a nM
Citation Kiesewetter, DOLee, JLang, LPark, SGPaik, CHEckelman, WC Preparation of 18F-labeled muscarinic agonist with M2 selectivity. J Med Chem38:5-8 (1995) Muscarinic acetylcholine receptor
Name:Muscarinic acetylcholine receptor
Type:n/a
Mol. Mass.:66272.13
Organism:Cavia porcellus
Description:n/a
Residue:587
BDBM50407329
NameBDBM50407329
Synonyms:CHEMBL2112938
TypeSmall organic molecule
Emp. Form.C10H14FN3S2
Mol. Mass.259.367
SMILESCN1CCC=C(C1)c1nsnc1SCCF