Reaction Details
TargetATP-citrate synthase
LigandBDBM50036215
Substrate/Competitorn/a
Meas. Tech.ChEMBL_29524 (CHEMBL640440)
Ki 18000±n/a nM
Citation Dolle, REGribble, AWilkes, TKruse, LIEggleston, DSaxty, BAWells, TNGroot, PH Synthesis of novel thiol-containing citric acid analogues. Kinetic evaluation of these and other potential active-site-directed and mechanism-based inhibitors of ATP citrate lyase. J Med Chem38:537-43 (1995) ATP-citrate synthase
Name:ATP-citrate synthase
Type:PROTEIN
Mol. Mass.:120645.65
Organism:Rattus norvegicus
Description:ChEMBL_857791
Residue:1100
BDBM50036215
NameBDBM50036215
Synonyms:(2S,3R)-2-Carboxymethyl-oxirane-2,3-dicarboxylic acid | CHEMBL149910
TypeSmall organic molecule
Emp. Form.C6H6O7
Mol. Mass.190.1076
SMILESOC(=O)C[C@@]1(O[C@H]1C(O)=O)C(O)=O