Reaction Details
TargetGag-Pol polyprotein [489-587]
LigandBDBM50036256
Substrate/Competitorn/a
Meas. Tech.ChEMBL_157540 (CHEMBL764925)
Ki 1872±n/a nM
Citation Vazquez, MLBryant, MLClare, MDeCrescenzo, GADoherty, EMFreskos, JNGetman, DPHouseman, KAJulien, JAKocan, GP Inhibitors of HIV-1 protease containing the novel and potent (R)-(hydroxyethyl)sulfonamide isostere. J Med Chem38:581-4 (1995) Gag-Pol polyprotein [489-587]
Name:Gag-Pol polyprotein [489-587]
Type:Enzyme Subunit
Mol. Mass.:10781.16
Organism:Human immunodeficiency virus type 1
Description:P04585[489-587]
Residue:99
BDBM50036256
NameBDBM50036256
Synonyms:CHEMBL154798 | {(1S,2R)-1-Benzyl-2-hydroxy-3-[methanesulfonyl-(3-methyl-butyl)-amino]-propyl}-carbamic acid benzyl ester
TypeSmall organic molecule
Emp. Form.C24H34N2O5S
Mol. Mass.462.602
SMILESCC(C)CCN(C[C@@H](O)[C@H](Cc1ccccc1)NC(=O)OCc1ccccc1)S(C)(=O)=O