Reaction Details
TargetGag-Pol polyprotein [489-587]
LigandBDBM50036258
Substrate/Competitorn/a
Meas. Tech.ChEMBL_159284 (CHEMBL878766)
IC50 100±n/a nM
Citation Vazquez, MLBryant, MLClare, MDeCrescenzo, GADoherty, EMFreskos, JNGetman, DPHouseman, KAJulien, JAKocan, GP Inhibitors of HIV-1 protease containing the novel and potent (R)-(hydroxyethyl)sulfonamide isostere. J Med Chem38:581-4 (1995) Gag-Pol polyprotein [489-587]
Name:Gag-Pol polyprotein [489-587]
Type:Enzyme Subunit
Mol. Mass.:10781.16
Organism:Human immunodeficiency virus type 1
Description:P04585[489-587]
Residue:99
BDBM50036258
NameBDBM50036258
Synonyms:((S)-1-{(1S,2R)-1-Benzyl-2-hydroxy-3-[methanesulfonyl-(3-methyl-butyl)-amino]-propylcarbamoyl}-2-carbamoyl-ethyl)-carbamic acid benzyl ester | CHEMBL154252
TypeSmall organic molecule
Emp. Form.C28H40N4O7S
Mol. Mass.576.705
SMILESCC(C)CCN(C[C@@H](O)[C@H](Cc1ccccc1)NC(=O)[C@H](CC(N)=O)NC(=O)OCc1ccccc1)S(C)(=O)=O