Reaction Details
TargetGag-Pol polyprotein [489-587]
LigandBDBM50036252
Substrate/Competitorn/a
Meas. Tech.ChEMBL_157543 (CHEMBL764927)
Ki 4.1±n/a nM
Citation Vazquez, MLBryant, MLClare, MDeCrescenzo, GADoherty, EMFreskos, JNGetman, DPHouseman, KAJulien, JAKocan, GP Inhibitors of HIV-1 protease containing the novel and potent (R)-(hydroxyethyl)sulfonamide isostere. J Med Chem38:581-4 (1995) Gag-Pol polyprotein [489-587]
Name:Gag-Pol polyprotein [489-587]
Type:Enzyme Subunit
Mol. Mass.:10781.16
Organism:Human immunodeficiency virus type 1
Description:P04585[489-587]
Residue:99
BDBM50036252
NameBDBM50036252
Synonyms:CHEMBL347671 | {(1S,2R)-1-Benzyl-3-[(4-chloro-benzenesulfonyl)-(3-methyl-butyl)-amino]-2-hydroxy-propyl}-carbamic acid benzyl ester
TypeSmall organic molecule
Emp. Form.C29H35ClN2O5S
Mol. Mass.559.117
SMILESCC(C)CCN(C[C@@H](O)[C@H](Cc1ccccc1)NC(=O)OCc1ccccc1)S(=O)(=O)c1ccc(Cl)cc1