Reaction Details
TargetGag-Pol polyprotein [489-587]
LigandBDBM50036262
Substrate/Competitorn/a
Meas. Tech.ChEMBL_159284 (CHEMBL878766)
IC50 14±n/a nM
Citation Vazquez, MLBryant, MLClare, MDeCrescenzo, GADoherty, EMFreskos, JNGetman, DPHouseman, KAJulien, JAKocan, GP Inhibitors of HIV-1 protease containing the novel and potent (R)-(hydroxyethyl)sulfonamide isostere. J Med Chem38:581-4 (1995) Gag-Pol polyprotein [489-587]
Name:Gag-Pol polyprotein [489-587]
Type:Enzyme Subunit
Mol. Mass.:10781.16
Organism:Human immunodeficiency virus type 1
Description:P04585[489-587]
Residue:99
BDBM50036262
NameBDBM50036262
Synonyms:CHEMBL348282 | [(1S,2R)-3-(Benzenesulfonyl-cyclohexylmethyl-amino)-1-benzyl-2-hydroxy-propyl]-carbamic acid benzyl ester
TypeSmall organic molecule
Emp. Form.C31H38N2O5S
Mol. Mass.550.709
SMILESO[C@H](CN(CC1CCCCC1)S(=O)(=O)c1ccccc1)[C@H](Cc1ccccc1)NC(=O)OCc1ccccc1