Reaction Details
TargetEndothelin-1 receptor
LigandBDBM50034435
Substrate/Competitorn/a
Meas. Tech.ChEMBL_63361 (CHEMBL676097)
IC50 15±n/a nM
Citation Krystek, SRHunt, JTStein, PDStouch, TR Three-dimensional quantitative structure-activity relationships of sulfonamide endothelin inhibitors. J Med Chem38:659-68 (1995) Endothelin-1 receptor
Name:Endothelin-1 receptor
Type:Enzyme Catalytic Domain
Mol. Mass.:48256.91
Organism:RAT
Description:ENDOTHELIN A EDNRA RAT::P26684
Residue:426
BDBM50034435
NameBDBM50034435
Synonyms:5-Dimethylamino-naphthalene-1-sulfonic acid (3,4-dimethyl-2,3-dihydro-oxazol-5-yl)-amide 5-Dimethylamino-naphthalene-1-sulfonic acid (3,4-dimethyl-isoxazol-5-yl)-amide (BMS 182874) CHEMBL267458
TypeSmall organic molecule
Emp. Form.C17H19N3O3S
Mol. Mass.345.416
SMILESCN(C)c1cccc2c(cccc12)S(=O)(=O)Nc1onc(C)c1C