Reaction Details
TargetD(2) dopamine receptor
LigandBDBM21398
Substrate/Competitorn/a
Meas. Tech.ChEBML_62887
Ki 0.470000±n/a nM
Citation Mewshaw, REAbreu, MESilverman, LSMathew, RMTiffany, CWBailey, MAKarbon, EWFerkany, JWKaiser, C Examination of the D2/5-HT2 affinity ratios of resolved 5,6,7,8,9,10-hexahydro-7,10-iminocyclohept[b]indoles: an enantioselective approach toward the design of potential atypical antipsychotics. J Med Chem36:3073-6 (1993) D(2) dopamine receptor
Name:D(2) dopamine receptor
Type:G Protein-Coupled Receptor (GPCR)
Mol. Mass.:50931.60
Organism:Rattus norvegicus (rat)
Description:P61169
Residue:444
BDBM21398
NameBDBM21398
Synonyms:4-[4-(4-Chloro-phenyl)-4-hydroxy-piperidin-1-yl]-1-(4-fluoro-phenyl)-butan-1-one;propionate(HCl) CHEMBL54 Haloperidol | Haloperidol, 1
TypeSmall organic molecule
Emp. Form.C21H23ClFNO2
Mol. Mass.375.864
SMILESOC1(CCN(CCCC(=O)c2ccc(F)cc2)CC1)c1ccc(Cl)cc1