Reaction Details
TargetD(2) dopamine receptor
LigandBDBM50036732
Substrate/Competitorn/a
Meas. Tech.ChEBML_42561
Ki 101±n/a nM
Citation Jaen, JCCaprathe, BWPugsley, TAWise, LDAkunne, H Evaluation of the effects of the enantiomers of reduced haloperidol, azaperol, and related 4-amino-1-arylbutanols on dopamine and sigma receptors. J Med Chem36:3929-36 (1994) D(2) dopamine receptor
Name:D(2) dopamine receptor
Type:Cell-surface receptors
Mol. Mass.:50647.10
Organism:Homo sapiens (Human)
Description:P14416
Residue:443
BDBM50036732
NameBDBM50036732
Synonyms:(S)-1-(4-Fluoro-phenyl)-4-(4-pyridin-2-yl-piperazin-1-yl)-butan-1-ol | CHEMBL339963
TypeSmall organic molecule
Emp. Form.C19H24FN3O
Mol. Mass.329.4118
SMILESO[C@@H](CCCN1CCN(CC1)c1ccccn1)c1ccc(F)cc1