Reaction Details
TargetSigma non-opioid intracellular receptor 1
LigandBDBM50036736
Substrate/Competitorn/a
Meas. Tech.ChEBML_226570
Ki 490±n/a nM
Citation Jaen, JCCaprathe, BWPugsley, TAWise, LDAkunne, H Evaluation of the effects of the enantiomers of reduced haloperidol, azaperol, and related 4-amino-1-arylbutanols on dopamine and sigma receptors. J Med Chem36:3929-36 (1994) Sigma non-opioid intracellular receptor 1
Name:Sigma non-opioid intracellular receptor 1
Type:Enzyme Catalytic Domain
Mol. Mass.:25124.85
Organism:Homo sapiens (Human)
Description:Q99720
Residue:223
BDBM50036736
NameBDBM50036736
Synonyms:(S)-1-(4-Fluoro-phenyl)-4-[4-(5-fluoro-pyrimidin-2-yl)-piperazin-1-yl]-butan-1-ol | CHEMBL129263
TypeSmall organic molecule
Emp. Form.C18H22F2N4O
Mol. Mass.348.3903
SMILESO[C@@H](CCCN1CCN(CC1)c1ncc(F)cn1)c1ccc(F)cc1