Reaction Details
TargetD(2) dopamine receptor
LigandBDBM21398
Substrate/Competitorn/a
Meas. Tech.ChEBML_42561
Ki 0.440000±n/a nM
Citation Jaen, JCCaprathe, BWPugsley, TAWise, LDAkunne, H Evaluation of the effects of the enantiomers of reduced haloperidol, azaperol, and related 4-amino-1-arylbutanols on dopamine and sigma receptors. J Med Chem36:3929-36 (1994) D(2) dopamine receptor
Name:D(2) dopamine receptor
Type:Cell-surface receptors
Mol. Mass.:50647.10
Organism:Homo sapiens (Human)
Description:P14416
Residue:443
BDBM21398
NameBDBM21398
Synonyms:4-[4-(4-Chloro-phenyl)-4-hydroxy-piperidin-1-yl]-1-(4-fluoro-phenyl)-butan-1-one;propionate(HCl) CHEMBL54 Haloperidol | Haloperidol, 1
TypeSmall organic molecule
Emp. Form.C21H23ClFNO2
Mol. Mass.375.864
SMILESOC1(CCN(CCCC(=O)c2ccc(F)cc2)CC1)c1ccc(Cl)cc1