Reaction Details
TargetD(2) dopamine receptor
LigandBDBM50036738
Substrate/Competitorn/a
Meas. Tech.ChEBML_42561
Ki 279±n/a nM
Citation Jaen, JCCaprathe, BWPugsley, TAWise, LDAkunne, H Evaluation of the effects of the enantiomers of reduced haloperidol, azaperol, and related 4-amino-1-arylbutanols on dopamine and sigma receptors. J Med Chem36:3929-36 (1994) D(2) dopamine receptor
Name:D(2) dopamine receptor
Type:Cell-surface receptors
Mol. Mass.:50647.10
Organism:Homo sapiens (Human)
Description:P14416
Residue:443
BDBM50036738
NameBDBM50036738
Synonyms:(R)-4-(4-Chloro-phenyl)-1-[4-(4-fluoro-phenyl)-4-hydroxy-butyl]-piperidin-4-ol | CHEMBL129159
TypeSmall organic molecule
Emp. Form.C21H25ClFNO2
Mol. Mass.377.88
SMILESO[C@H](CCCN1CCC(O)(CC1)c1ccc(Cl)cc1)c1ccc(F)cc1