Reaction Details
TargetD(2) dopamine receptor
LigandBDBM50036733
Substrate/Competitorn/a
Meas. Tech.ChEBML_42561
Ki 52±n/a nM
Citation Jaen, JCCaprathe, BWPugsley, TAWise, LDAkunne, H Evaluation of the effects of the enantiomers of reduced haloperidol, azaperol, and related 4-amino-1-arylbutanols on dopamine and sigma receptors. J Med Chem36:3929-36 (1994) D(2) dopamine receptor
Name:D(2) dopamine receptor
Type:Cell-surface receptors
Mol. Mass.:50647.10
Organism:Homo sapiens (Human)
Description:P14416
Residue:443
BDBM50036733
NameBDBM50036733
Synonyms:1-(4-Fluoro-phenyl)-4-(4-pyridin-2-yl-piperazin-1-yl)-butan-1-one(Azaperone) CHEMBL340211
TypeSmall organic molecule
Emp. Form.C19H22FN3O
Mol. Mass.327.3959
SMILESFc1ccc(cc1)C(=O)CCCN1CCN(CC1)c1ccccn1