Reaction Details
TargetBeta-1 adrenergic receptor
LigandBDBM50036835
Substrate/Competitorn/a
Meas. Tech.ChEMBL_37537 (CHEMBL647619)
Ki 51±n/a nM
Citation Macchia, BBalsamo, ABreschi, MCChiellini, GMacchia, MMartinelli, AMartini, CNardini, CNencetti, SRossello, A The [(methyloxy)imino]methyl moiety as a bioisoster of aryl. A novel class of completely aliphatic beta-adrenergic receptor antagonists. J Med Chem37:1518-25 (1994) Beta-1 adrenergic receptor
Name:Beta-1 adrenergic receptor
Type:Protein
Mol. Mass.:50486.84
Organism:Rattus norvegicus (Rat)
Description:P18090
Residue:466
BDBM50036835
NameBDBM50036835
Synonyms:1-(3,4-Dichloro-phenyl)-2-isopropylamino-ethanol CHEMBL30816 | Dichloroisoproterenol,(+/-)
TypeSmall organic molecule
Emp. Form.C11H15Cl2NO
Mol. Mass.248.149
SMILESCC(C)NCC(O)c1ccc(Cl)c(Cl)c1