Reaction Details
TargetRenin
LigandBDBM50036971
Substrate/Competitorn/a
Meas. Tech.ChEMBL_196422 (CHEMBL872990)
IC50 10000±n/a nM
Citation Boyd, SAFung, AKBaker, WRMantei, RAStein, HHCohen, JBarlow, JLKlinghofer, VWessale, JLVerburg, KM Nonpeptide renin inhibitors with good intraduodenal bioavailability and efficacy in dog. J Med Chem37:2991-3007 (1994) Renin
Name:Renin
Type:PROTEIN
Mol. Mass.:44272.67
Organism:Rattus norvegicus
Description:ChEMBL_222765
Residue:402
BDBM50036971
NameBDBM50036971
Synonyms:(2S,4S,5S)-5-{(S)-2-[(S)-1-Benzyl-2-(4-methoxymethoxy-piperidin-1-yl)-2-oxo-ethylamino]-hexanoylamino}-6-cyclohexyl-4-hydroxy-2-isopropyl-hexanoic acid (pyridin-4-ylmethyl)-amide | CHEMBL320665
TypeSmall organic molecule
Emp. Form.C43H67N5O6
Mol. Mass.750.022
SMILESCCCC[C@H](N[C@@H](Cc1ccccc1)C(=O)N1CCC(CC1)OCOC)C(=O)N[C@@H](CC1CCCCC1)[C@@H](O)C[C@@H](C(C)C)C(=O)NCc1ccncc1