Reaction Details
TargetRenin
LigandBDBM50037004
Substrate/Competitorn/a
Meas. Tech.ChEMBL_195974 (CHEMBL807522)
pH7.4±n/a
IC50 12±n/a nM
Commentsextracted
Citation Boyd, SAFung, AKBaker, WRMantei, RAStein, HHCohen, JBarlow, JLKlinghofer, VWessale, JLVerburg, KM Nonpeptide renin inhibitors with good intraduodenal bioavailability and efficacy in dog. J Med Chem37:2991-3007 (1994) Renin
Name:Renin
Type:Enzyme
Mol. Mass.:45058.99
Organism:Homo sapiens (Human)
Description:n/a
Residue:406
BDBM50037004
NameBDBM50037004
Synonyms:3-((2S,4S,5S)-5-{(S)-2-[(S)-1-Benzyl-2-(4-methoxymethoxy-piperidin-1-yl)-2-oxo-ethoxy]-hexanoylamino}-6-cyclohexyl-4-hydroxy-2-isopropyl-hexanoylamino)-propionic acid ethyl ester | CHEMBL101074
TypeSmall organic molecule
Emp. Form.C42H69N3O9
Mol. Mass.760.012
SMILESCCCC[C@H](O[C@@H](Cc1ccccc1)C(=O)N1CCC(CC1)OCOC)C(=O)N[C@@H](CC1CCCCC1)[C@@H](O)C[C@@H](C(C)C)C(=O)NCCC(=O)OCC