Reaction Details
TargetLeukotriene B4 receptor 1
LigandBDBM50037376
Substrate/Competitorn/a
Meas. Tech.ChEMBL_99829 (CHEMBL709859)
Ki 4.8±n/a nM
Citation Daines, RAChambers, PAEggleston, DSFoley, JJGriswold, DEHaltiwanger, RCJakas, DRKingsbury, WDMartin, LDPendrak, I (E)-3-[[[[6-(2-carboxyethenyl)-5-[[8-(4- methoxyphenyl)octyl]oxy]-2-pyridinyl]-methyl]thio]methyl]benzoic acid and related compounds: high affinity leukotriene B4 receptor antagonists. J Med Chem37:3327-36 (1994) Leukotriene B4 receptor 1
Name:Leukotriene B4 receptor 1
Type:Enzyme Catalytic Domain
Mol. Mass.:37582.68
Organism:Homo sapiens (Human)
Description:Q15722
Residue:352
BDBM50037376
NameBDBM50037376
Synonyms:3-[6-((E)-2-Carboxy-vinyl)-5-(4-phenyl-butoxy)-pyridin-2-ylmethylsulfanylmethyl]-benzoic acid | CHEMBL115658
TypeSmall organic molecule
Emp. Form.C27H27NO5S
Mol. Mass.477.572
SMILESOC(=O)\C=C\c1nc(CSCc2cccc(c2)C(O)=O)ccc1OCCCCc1ccccc1