Reaction Details
TargetLeukotriene B4 receptor 1
LigandBDBM50037390
Substrate/Competitorn/a
Meas. Tech.ChEMBL_99829 (CHEMBL709859)
Ki 1.3±n/a nM
Citation Daines, RAChambers, PAEggleston, DSFoley, JJGriswold, DEHaltiwanger, RCJakas, DRKingsbury, WDMartin, LDPendrak, I (E)-3-[[[[6-(2-carboxyethenyl)-5-[[8-(4- methoxyphenyl)octyl]oxy]-2-pyridinyl]-methyl]thio]methyl]benzoic acid and related compounds: high affinity leukotriene B4 receptor antagonists. J Med Chem37:3327-36 (1994) Leukotriene B4 receptor 1
Name:Leukotriene B4 receptor 1
Type:Enzyme Catalytic Domain
Mol. Mass.:37582.68
Organism:Homo sapiens (Human)
Description:Q15722
Residue:352
BDBM50037390
NameBDBM50037390
Synonyms:3-{(S)-2-(2-Carboxy-ethyl)-7-[3-(2-cyclopropylmethyl-3-methoxy-4-methylcarbamoyl-phenoxy)-propoxy]-chroman-8-yl}-propionic acid CHEMBL419948 | SC-53228
TypeSmall organic molecule
Emp. Form.C31H41NO7
Mol. Mass.539.6597
SMILESCCCc1c(OCCCOc2ccc(C(=O)NC)c(OC)c2CC2CC2)ccc2CC[C@@H](CCC(O)=O)Oc12