Reaction Details
TargetLeukotriene B4 receptor 1
LigandBDBM50037391
Substrate/Competitorn/a
Meas. Tech.ChEMBL_99829 (CHEMBL709859)
Ki 1±n/a nM
Citation Daines, RAChambers, PAEggleston, DSFoley, JJGriswold, DEHaltiwanger, RCJakas, DRKingsbury, WDMartin, LDPendrak, I (E)-3-[[[[6-(2-carboxyethenyl)-5-[[8-(4- methoxyphenyl)octyl]oxy]-2-pyridinyl]-methyl]thio]methyl]benzoic acid and related compounds: high affinity leukotriene B4 receptor antagonists. J Med Chem37:3327-36 (1994) Leukotriene B4 receptor 1
Name:Leukotriene B4 receptor 1
Type:Enzyme Catalytic Domain
Mol. Mass.:37582.68
Organism:Homo sapiens (Human)
Description:Q15722
Residue:352
BDBM50037391
NameBDBM50037391
Synonyms:5-{2-(2-Carboxy-ethyl)-3-[6-(4-oxo-8-propyl-chroman-7-yloxy)-hexyl]-phenoxy}-pentanoic acid Ro-25-3562
TypeSmall organic molecule
Emp. Form.C32H42O8
Mol. Mass.554.6711
SMILESCCCc1c(OCCCCCCc2cccc(OCCCCC(O)=O)c2CCC(O)=O)ccc2C(=O)CCOc12