Reaction Details
TargetLeukotriene B4 receptor 1
LigandBDBM50037379
Substrate/Competitorn/a
Meas. Tech.ChEMBL_99829 (CHEMBL709859)
Ki 28±n/a nM
Citation Daines, RAChambers, PAEggleston, DSFoley, JJGriswold, DEHaltiwanger, RCJakas, DRKingsbury, WDMartin, LDPendrak, I (E)-3-[[[[6-(2-carboxyethenyl)-5-[[8-(4- methoxyphenyl)octyl]oxy]-2-pyridinyl]-methyl]thio]methyl]benzoic acid and related compounds: high affinity leukotriene B4 receptor antagonists. J Med Chem37:3327-36 (1994) Leukotriene B4 receptor 1
Name:Leukotriene B4 receptor 1
Type:Enzyme Catalytic Domain
Mol. Mass.:37582.68
Organism:Homo sapiens (Human)
Description:Q15722
Residue:352
BDBM50037379
NameBDBM50037379
Synonyms:3-{6-(2-Carboxy-ethyl)-5-[4-(4-methoxy-phenyl)-butoxy]-pyridin-2-ylmethylsulfanylmethyl}-benzoic acid | CHEMBL115040
TypeSmall organic molecule
Emp. Form.C28H31NO6S
Mol. Mass.509.614
SMILESCOc1ccc(CCCCOc2ccc(CSCc3cccc(c3)C(O)=O)nc2CCC(O)=O)cc1