Reaction Details
TargetKappa-type opioid receptor
LigandBDBM50037586
Substrate/Competitorn/a
Meas. Tech.ChEMBL_145564 (CHEMBL752653)
Ki 5.44±n/a nM
Citation Giardina, GClarke, GDDondio, GPetrone, GSbacchi, MVecchietti, V Selective kappa-opioid agonists: synthesis and structure-activity relationships of piperidines incorporating on oxo-containing acyl group. J Med Chem37:3482-91 (1994) Kappa-type opioid receptor
Name:Kappa-type opioid receptor
Type:Enzyme
Mol. Mass.:42656.78
Organism:Mus musculus (Mouse)
Description:P33534
Residue:380
BDBM50037586
NameBDBM50037586
Synonyms:2-[2-Oxo-2-((S)-2-pyrrolidin-1-ylmethyl-piperidin-1-yl)-ethyl]-6,7,8,9-tetrahydro-benzocyclohepten-5-one | CHEMBL326553
TypeSmall organic molecule
Emp. Form.C23H32N2O2
Mol. Mass.368.5124
SMILESO=C(Cc1ccc2c(CCCCC2=O)c1)N1CCCC[C@H]1CN1CCCC1