Reaction Details
TargetDelta-type opioid receptor
LigandBDBM50037581
Substrate/Competitorn/a
Meas. Tech.ChEMBL_146337 (CHEMBL753786)
Ki>100±n/a nM
Citation Giardina, GClarke, GDDondio, GPetrone, GSbacchi, MVecchietti, V Selective kappa-opioid agonists: synthesis and structure-activity relationships of piperidines incorporating on oxo-containing acyl group. J Med Chem37:3482-91 (1994) Delta-type opioid receptor
Name:Delta-type opioid receptor
Type:Enzyme Catalytic Domain
Mol. Mass.:40577.25
Organism:MOUSE
Description:P32300
Residue:372
BDBM50037581
NameBDBM50037581
Synonyms:6-[2-((S)-2-Dimethylaminomethyl-piperidin-1-yl)-2-oxo-ethyl]-3,4-dihydro-2H-naphthalen-1-one | CHEMBL119524
TypeSmall organic molecule
Emp. Form.C20H28N2O2
Mol. Mass.328.4485
SMILESCN(C)C[C@@H]1CCCCN1C(=O)Cc1ccc2C(=O)CCCc2c1