Reaction Details
TargetSterol O-acyltransferase 1
LigandBDBM50037615
Substrate/Competitorn/a
Meas. Tech.ChEMBL_28496 (CHEMBL645926)
IC50 40±n/a nM
Citation Higley, CAWilde, RGMaduskuie, TPJohnson, ALPennev, PBillheimer, JTRobinson, CSGillies, PJWexler, RR Acyl CoA:cholesterol acyltransferase (ACAT) inhibitors: synthesis and structure-activity relationship studies of a new series of trisubstituted imidazoles. J Med Chem37:3511-22 (1994) Sterol O-acyltransferase 1
Name:Sterol O-acyltransferase 1
Type:PROTEIN
Mol. Mass.:64165.56
Organism:Rattus norvegicus
Description:ChEMBL_28796
Residue:545
BDBM50037615
NameBDBM50037615
Synonyms:1-(2,4-Difluoro-phenyl)-1-[5-(4,5-diphenyl-1H-imidazol-2-ylsulfanyl)-pentyl]-3-octyl-urea | CHEMBL117919
TypeSmall organic molecule
Emp. Form.C35H42F2N4OS
Mol. Mass.604.796
SMILESCCCCCCCCNC(=O)N(CCCCCSc1nc(c([nH]1)-c1ccccc1)-c1ccccc1)c1ccc(F)cc1F