Reaction Details
TargetGag-Pol polyprotein [489-587]
LigandBDBM50037811
Substrate/Competitorn/a
Meas. Tech.ChEMBL_157568 (CHEMBL763319)
Ki 5±n/a nM
Citation Podlogar, BLFarr, RAFriedrich, DTarnus, CHuber, EWCregge, RJSchirlin, D Design, synthesis, and conformational analysis of a novel macrocyclic HIV-protease inhibitor. J Med Chem37:3684-92 (1994) Gag-Pol polyprotein [489-587]
Name:Gag-Pol polyprotein [489-587]
Type:Enzyme Subunit
Mol. Mass.:10781.16
Organism:Human immunodeficiency virus type 1
Description:P04585[489-587]
Residue:99
BDBM50037811
NameBDBM50037811
Synonyms:CHEMBL123016 | {(S)-1-[(S)-3-Benzylcarbamoyl-1-(4-benzyloxy-benzyl)-3,3-difluoro-2-oxo-propylcarbamoyl]-2-methyl-propyl}-carbamic acid benzyl ester
TypeSmall organic molecule
Emp. Form.C38H39F2N3O6
Mol. Mass.671.7296
SMILESCC(C)[C@H](NC(=O)OCc1ccccc1)C(=O)N[C@@H](Cc1ccc(OCc2ccccc2)cc1)C(=O)C(F)(F)C(=O)NCc1ccccc1