Reaction Details
TargetHistone deacetylase 2
LigandBDBM50330794
Substrate/Competitorn/a
Meas. Tech.ChEMBL_972539 (CHEMBL2410191)
Ki 15±n/a nM
Citation Ononye, SNVanHeyst, MDOblak, EZZhou, WAmmar, MAnderson, ACWright, DL Tropolones as lead-like natural products: the development of potent and selective histone deacetylase inhibitors. ACS Med Chem Lett4:757-61 (2013) 
 
Histone deacetylase 2
Name:Histone deacetylase 2
Type:Chromatin regulator; hydrolase; repressor
Mol. Mass.:55356.54
Organism:Homo sapiens (Human)
Description:Q92769
Residue:488
BDBM50330794
NameBDBM50330794
Synonyms:2-Hydroxy-4-isopropyl-cyclohepta-2,4,6-trienone CHEMBL48310 hinokitiol
TypeSmall organic molecule
Emp. Form.C10H12O2
Mol. Mass.164.2011
SMILESCC(C)c1cccc(=O)c(O)c1