Reaction Details
TargetMuscarinic acetylcholine receptor M2
LigandBDBM50018300
Substrate/Competitorn/a
Meas. Tech.ChEMBL_140105 (CHEMBL748286)
IC50 220±n/a nM
Citation Burke, BJDunn, WJHopfinger, AJ Construction of a molecular shape analysis-three-dimensional quantitative structure-analysis relationship for an analog series of pyridobenzodiazepinone inhibitors of muscarinic 2 and 3 receptors. J Med Chem37:3775-88 (1994) Muscarinic acetylcholine receptor M2
Name:Muscarinic acetylcholine receptor M2
Type:Enzyme Catalytic Domain
Mol. Mass.:51555.53
Organism:RAT
Description:P10980
Residue:466
BDBM50018300
NameBDBM50018300
Synonyms:11-[3-(2-Diethylaminomethyl-piperidin-1-yl)-propionyl]-5,11-dihydro-benzo[e]pyrido[3,2-b][1,4]diazepin-6-one | CHEMBL296317
TypeSmall organic molecule
Emp. Form.C25H33N5O2
Mol. Mass.435.5618
SMILESCCN(CC)CC1CCCCN1CCC(=O)N1c2ccccc2C(=O)Nc2cccnc12