Reaction Details
TargetMuscarinic acetylcholine receptor M3
LigandBDBM50018304
Substrate/Competitorn/a
Meas. Tech.ChEMBL_138247 (CHEMBL745497)
IC50 70±n/a nM
Citation Burke, BJDunn, WJHopfinger, AJ Construction of a molecular shape analysis-three-dimensional quantitative structure-analysis relationship for an analog series of pyridobenzodiazepinone inhibitors of muscarinic 2 and 3 receptors. J Med Chem37:3775-88 (1994) Muscarinic acetylcholine receptor M3
Name:Muscarinic acetylcholine receptor M3
Type:Enzyme Catalytic Domain
Mol. Mass.:66086.66
Organism:RAT
Description:Cholinergic, muscarinic M3 CHRM3 RAT::P08483
Residue:589
BDBM50018304
NameBDBM50018304
Synonyms:11-(2-{2-[(Cycloheptyl-methyl-amino)-methyl]-piperidin-1-yl}-acetyl)-5,11-dihydro-benzo[e]pyrido[3,2-b][1,4]diazepin-6-one | CHEMBL46315
TypeSmall organic molecule
Emp. Form.C28H37N5O2
Mol. Mass.475.6257
SMILESCN(CC1CCCCN1CC(=O)N1c2ccccc2C(=O)Nc2cccnc12)C1CCCCCC1