Reaction Details
TargetMuscarinic acetylcholine receptor M2
LigandBDBM50018292
Substrate/Competitorn/a
Meas. Tech.ChEMBL_140105 (CHEMBL748286)
IC50 30±n/a nM
Citation Burke, BJDunn, WJHopfinger, AJ Construction of a molecular shape analysis-three-dimensional quantitative structure-analysis relationship for an analog series of pyridobenzodiazepinone inhibitors of muscarinic 2 and 3 receptors. J Med Chem37:3775-88 (1994) Muscarinic acetylcholine receptor M2
Name:Muscarinic acetylcholine receptor M2
Type:Enzyme Catalytic Domain
Mol. Mass.:51555.53
Organism:RAT
Description:P10980
Residue:466
BDBM50018292
NameBDBM50018292
Synonyms:11-[2-(2-Diethylaminomethyl-piperidin-1-yl)-acetyl]-8-methyl-5,11-dihydro-benzo[e]pyrido[3,2-b][1,4]diazepin-6-one | CHEMBL297224
TypeSmall organic molecule
Emp. Form.C25H33N5O2
Mol. Mass.435.5618
SMILESCCN(CC)CC1CCCCN1CC(=O)N1c2ccc(C)cc2C(=O)Nc2cccnc12