Reaction Details
TargetCholecystokinin receptor type A
LigandBDBM50037847
Substrate/Competitorn/a
Meas. Tech.ChEMBL_49715 (CHEMBL661792)
IC50 71±n/a nM
Citation Lowe, JAHageman, DLDrozda, SEMcLean, SBryce, DKCrawford, RTZorn, SMorrone, JBordner, J 5-Phenyl-3-ureidobenzazepin-2-ones as cholecystokinin-B receptor antagonists. J Med Chem37:3789-811 (1994) Cholecystokinin receptor type A
Name:Cholecystokinin receptor type A
Type:n/a
Mol. Mass.:48229.77
Organism:Cavia porcellus
Description:n/a
Residue:430
BDBM50037847
NameBDBM50037847
Synonyms:CHEMBL124004 | N-tert-Butyl-2-{(3R,5R)-3-[3-(3-chloro-phenyl)-ureido]-8-ethyl-2-oxo-5-phenyl-2,3,4,5-tetrahydro-benzo[b]azepin-1-yl}-acetamide
TypeSmall organic molecule
Emp. Form.C31H35ClN4O3
Mol. Mass.547.088
SMILESCCc1ccc2[C@H](C[C@@H](NC(=O)Nc3cccc(Cl)c3)C(=O)N(CC(=O)NC(C)(C)C)c2c1)c1ccccc1